{"text_format":"1","workbook":"xlsx","n_sheets":4,"sheets":["Scoresheet","Instructions","IPF GL Formula","WeightClasses"],"not_rendered":{"charts":0,"images":4,"macros":1,"external_links":0,"defined_names":1,"comments":0,"pivot_tables":0},"unopened":[],"bounds":{"document_bytes":16777216,"sheet_cells":100000,"rows_first":2000,"rows_last":500,"rows_between":2000,"halvings":0,"cell_chars":16384,"cell_head_chars":4096},"cells_cut":0,"cells_raw":0,"read":"whole","date_system":"1900"}

{"sheet":"Scoresheet","index":0,"n_rows":40,"n_cols":47,"rows_kept":40,"cut":false,"hidden":false,"merged":[[4,27,4,28],[4,23,4,24],[4,11,4,12],[4,13,4,14],[4,16,4,17],[4,18,4,19],[4,20,4,21],[2,4,2,16],[3,4,3,16],[4,9,4,10],[4,25,4,26],[1,4,1,16]]}
[null,null,null,null,null,null,null,null,null,null,null,null,null,null,null,null,null,null,"√","Good"]
[null,null,null,null,"Coupe de Luxembourg Powerlifting PWFL",null,null,null,null,null,null,null,null,null,null,null,null,null,"+","Record"]
[null,null,null,null,"Hamm-Luxembourg",null,null,null,null,null,null,null,null,null,null,null,null,null,"×","NoLift"]
[null,null,null,null,"30 Juin 2024"]
["Gr.","Lot","Last \nName","First Name","Team","Birth Year","Division","Body Wt","WT Class","SQ-1",null,"SQ-2",null,"SQ-3",null,"Best SQ","BP-1",null,"BP-2",null,"BP-3",null,"Best BP","DL-1",null,"DL-2",null,"DL-3",null,"Best DL","RESULT","IPF GL Pts.","IPF GL Coeff.","Place"]
[1,"Op","Sacré","Margault","SC Hamm",1993,"F-CL-PL",67.3,{"$f":"IF(H6=\"\",\"\",VLOOKUP(H6,WeightClasses!$A$2:$E$18,IF(LEFT(G6,1)=\"F\",IF(YEAR(TODAY())-F6<24,4,2),IF(YEAR(TODAY())-F6<24,5,3)),TRUE))","v":69},"√",122.5,"√",130,"×",135.5,{"$f":"IF(OR(K6<>0,M6<>0,O6<>0),MAX(IF(OR(J6=$S$1,J6=$S$2),K6,0),IF(OR(L6=$S$1,L6=$S$2),M6,0),IF(OR(N6=$S$1,N6=$S$2),O6,0)),\"\")","v":130},"√",67.5,"√",72.5,"√",75,{"$f":"IF(OR(R6<>0,T6<>0,V6<>0),MAX(IF(OR(Q6=$S$1,Q6=$S$2),R6,0),IF(OR(S6=$S$1,S6=$S$2),T6,0),IF(OR(U6=$S$1,U6=$S$2),V6,0)),\"\")","v":75},"√",117.5,"√",127.5,"√",132.5,{"$f":"IF(OR(Y6<>0,AA6<>0,AC6<>0),MAX(IF(OR(X6=$S$1,X6=$S$2),Y6,0),IF(OR(Z6=$S$1,Z6=$S$2),AA6,0),IF(OR(AB6=$S$1,AB6=$S$2),AC6,0)),\"\")","v":132.5},{"$f":"IF(OR(P6<>\"\",W6<>\"\",AD6<>\"\"),IF(AU6,\"DSQ\",IF(AND(RIGHT(G6,2)=\"PL\"),IF(P6=\"\",0,P6)+IF(W6=\"\",0,W6)+IF(AD6=\"\",0,AD6),IF(AND(RIGHT(G6,2)=\"BP\",W6<>0),W6,IF(AND(RIGHT(G6,2)=\"DL\",AD6<>0),AD6,IF(AND(RIGHT(G6,2)=\"SQ\",P6<>0),P6,0))))),\"\")","v":337.5},{"$f":"IF(AND(AE6<>\"\",ISNUMBER(AE6)),AG6*AE6,\"\")","v":70.918537499999999},{"$f":"IF(OR(H6=\"\",H6=0),0, ROUND(100/(VLOOKUP($G6,'IPF GL Formula'!$A$4:$F$19,3,FALSE)-VLOOKUP($G6,'IPF GL Formula'!$A$4:$F$19,4,FALSE)*EXP(-VLOOKUP($G6,'IPF GL Formula'!$A$4:$F$19,5,FALSE)*H6)),6))","v":0.21012900000000001},null,{"$f":"J6=$S$3","v":false},{"$f":"L6=$S$3","v":false},{"$f":"N6=$S$3","v":true},{"$f":"Q6=$S$3","v":false},{"$f":"S6=$S$3","v":false},{"$f":"U6=$S$3","v":false},{"$f":"X6=$S$3","v":false},{"$f":"Z6=$S$3","v":false},{"$f":"AB6=$S$3","v":false},{"$f":"AND(AI6,AJ6,AK6)","v":false},{"$f":"AND(AL6,AM6,AN6)","v":false},{"$f":"AND(AO6,AP6,AQ6)","v":false},{"$f":"OR(AR6,AS6,AT6)","v":false}]
[1,"Jr","Alexandreas","Marina","SC Hamm",2000,"F-CL-PL",64.319999999999993,{"$f":"IF(H7=\"\",\"\",VLOOKUP(H7,WeightClasses!$A$2:$E$18,IF(LEFT(G7,1)=\"F\",IF(YEAR(TODAY())-F7<24,4,2),IF(YEAR(TODAY())-F7<24,5,3)),TRUE))","v":69},"√",105,"×",110,"×",110,{"$f":"IF(OR(K7<>0,M7<>0,O7<>0),MAX(IF(OR(J7=$S$1,J7=$S$2),K7,0),IF(OR(L7=$S$1,L7=$S$2),M7,0),IF(OR(N7=$S$1,N7=$S$2),O7,0)),\"\")","v":105},"√",57.5,"√",62.5,"√",65,{"$f":"IF(OR(R7<>0,T7<>0,V7<>0),MAX(IF(OR(Q7=$S$1,Q7=$S$2),R7,0),IF(OR(S7=$S$1,S7=$S$2),T7,0),IF(OR(U7=$S$1,U7=$S$2),V7,0)),\"\")","v":65},"√",112.5,"√",117.5,"×",120,{"$f":"IF(OR(Y7<>0,AA7<>0,AC7<>0),MAX(IF(OR(X7=$S$1,X7=$S$2),Y7,0),IF(OR(Z7=$S$1,Z7=$S$2),AA7,0),IF(OR(AB7=$S$1,AB7=$S$2),AC7,0)),\"\")","v":117.5},{"$f":"IF(OR(P7<>\"\",W7<>\"\",AD7<>\"\"),IF(AU7,\"DSQ\",IF(AND(RIGHT(G7,2)=\"PL\"),IF(P7=\"\",0,P7)+IF(W7=\"\",0,W7)+IF(AD7=\"\",0,AD7),IF(AND(RIGHT(G7,2)=\"BP\",W7<>0),W7,IF(AND(RIGHT(G7,2)=\"DL\",AD7<>0),AD7,IF(AND(RIGHT(G7,2)=\"SQ\",P7<>0),P7,0))))),\"\")","v":287.5},62.079300000000003,{"$f":"IF(OR(H7=\"\",H7=0),0, ROUND(100/(VLOOKUP($G7,'IPF GL Formula'!$A$4:$F$19,3,FALSE)-VLOOKUP($G7,'IPF GL Formula'!$A$4:$F$19,4,FALSE)*EXP(-VLOOKUP($G7,'IPF GL Formula'!$A$4:$F$19,5,FALSE)*H7)),6))","v":0.21592800000000001},null,{"$f":"J7=$S$3","v":false},{"$f":"L7=$S$3","v":true},{"$f":"N7=$S$3","v":true},{"$f":"Q7=$S$3","v":false},{"$f":"S7=$S$3","v":false},{"$f":"U7=$S$3","v":false},{"$f":"X7=$S$3","v":false},{"$f":"Z7=$S$3","v":false},{"$f":"AB7=$S$3","v":true},{"$f":"AND(AI7,AJ7,AK7)","v":false},{"$f":"AND(AL7,AM7,AN7)","v":false},{"$f":"AND(AO7,AP7,AQ7)","v":false},{"$f":"OR(AR7,AS7,AT7)","v":false}]
[1,"Jr","Weydert","Emma","SC Hamm",2004,"F-CL-PL",57.62,{"$f":"IF(H8=\"\",\"\",VLOOKUP(H8,WeightClasses!$A$2:$E$18,IF(LEFT(G8,1)=\"F\",IF(YEAR(TODAY())-F8<24,4,2),IF(YEAR(TODAY())-F8<24,5,3)),TRUE))","v":63},"√",105,"√",112.5,"+",118,{"$f":"IF(OR(K8<>0,M8<>0,O8<>0),MAX(IF(OR(J8=$S$1,J8=$S$2),K8,0),IF(OR(L8=$S$1,L8=$S$2),M8,0),IF(OR(N8=$S$1,N8=$S$2),O8,0)),\"\")","v":118},"√",57.5,"+",61,"×",63.5,{"$f":"IF(OR(R8<>0,T8<>0,V8<>0),MAX(IF(OR(Q8=$S$1,Q8=$S$2),R8,0),IF(OR(S8=$S$1,S8=$S$2),T8,0),IF(OR(U8=$S$1,U8=$S$2),V8,0)),\"\")","v":61},"√",135,"+",145.5,"+",150,{"$f":"IF(OR(Y8<>0,AA8<>0,AC8<>0),MAX(IF(OR(X8=$S$1,X8=$S$2),Y8,0),IF(OR(Z8=$S$1,Z8=$S$2),AA8,0),IF(OR(AB8=$S$1,AB8=$S$2),AC8,0)),\"\")","v":150},{"$f":"IF(OR(P8<>\"\",W8<>\"\",AD8<>\"\"),IF(AU8,\"DSQ\",IF(AND(RIGHT(G8,2)=\"PL\"),IF(P8=\"\",0,P8)+IF(W8=\"\",0,W8)+IF(AD8=\"\",0,AD8),IF(AND(RIGHT(G8,2)=\"BP\",W8<>0),W8,IF(AND(RIGHT(G8,2)=\"DL\",AD8<>0),AD8,IF(AND(RIGHT(G8,2)=\"SQ\",P8<>0),P8,0))))),\"\")","v":329},76.553694000000007,{"$f":"IF(OR(H8=\"\",H8=0),0, ROUND(100/(VLOOKUP($G8,'IPF GL Formula'!$A$4:$F$19,3,FALSE)-VLOOKUP($G8,'IPF GL Formula'!$A$4:$F$19,4,FALSE)*EXP(-VLOOKUP($G8,'IPF GL Formula'!$A$4:$F$19,5,FALSE)*H8)),6))","v":0.232686},null,{"$f":"J8=$S$3","v":false},{"$f":"L8=$S$3","v":false},{"$f":"N8=$S$3","v":false},{"$f":"Q8=$S$3","v":false},{"$f":"S8=$S$3","v":false},{"$f":"U8=$S$3","v":true},{"$f":"X8=$S$3","v":false},{"$f":"Z8=$S$3","v":false},{"$f":"AB8=$S$3","v":false},{"$f":"AND(AI8,AJ8,AK8)","v":false},{"$f":"AND(AL8,AM8,AN8)","v":false},{"$f":"AND(AO8,AP8,AQ8)","v":false},{"$f":"OR(AR8,AS8,AT8)","v":false}]
[1,"Op","Bennaoui","Najia","SC Hamm",1992,"F-CL-PL",85,{"$f":"IF(H9=\"\",\"\",VLOOKUP(H9,WeightClasses!$A$2:$E$18,IF(LEFT(G9,1)=\"F\",IF(YEAR(TODAY())-F9<24,4,2),IF(YEAR(TODAY())-F9<24,5,3)),TRUE))","v":"84+"},"√",147.5,"+",155.5,"+",158.5,158.5,"√",80,"×",85,"×",85,80,"√",150,"√",160,"×",172.5,160,398.5,74.912819499999998,{"$f":"IF(OR(H9=\"\",H9=0),0, ROUND(100/(VLOOKUP($G9,'IPF GL Formula'!$A$4:$F$19,3,FALSE)-VLOOKUP($G9,'IPF GL Formula'!$A$4:$F$19,4,FALSE)*EXP(-VLOOKUP($G9,'IPF GL Formula'!$A$4:$F$19,5,FALSE)*H9)),6))","v":0.18798699999999999},null,false,false,false,false,true,true,false,false,true,false,false,false,false]
[1,"Op","Giacomini","Laura","SC Hamm",1990,"F-CL-PL",84.85,{"$f":"IF(H10=\"\",\"\",VLOOKUP(H10,WeightClasses!$A$2:$E$18,IF(LEFT(G10,1)=\"F\",IF(YEAR(TODAY())-F10<24,4,2),IF(YEAR(TODAY())-F10<24,5,3)),TRUE))","v":"84+"},"√",117.5,"√",122.5,"√",125,125,"√",57.5,"×",62.5,"×",62.5,57.5,"√",130,"√",137.5,"√",142.5,142.5,325,61.137374999999999,{"$f":"IF(OR(H10=\"\",H10=0),0, ROUND(100/(VLOOKUP($G10,'IPF GL Formula'!$A$4:$F$19,3,FALSE)-VLOOKUP($G10,'IPF GL Formula'!$A$4:$F$19,4,FALSE)*EXP(-VLOOKUP($G10,'IPF GL Formula'!$A$4:$F$19,5,FALSE)*H10)),6))","v":0.188115},null,false,false,false,false,true,true,false,false,false,false,false,false,false]
[null,null,null,null,null,null,null,null,{"$f":"IF(H11=\"\",\"\",VLOOKUP(H11,WeightClasses!$A$2:$E$18,IF(LEFT(G11,1)=\"F\",IF(YEAR(TODAY())-F11<24,4,2),IF(YEAR(TODAY())-F11<24,5,3)),TRUE))","v":""},null,null,null,null,null,null,{"$f":"IF(OR(K11<>0,M11<>0,O11<>0),MAX(IF(OR(J11=$S$1,J11=$S$2),K11,0),IF(OR(L11=$S$1,L11=$S$2),M11,0),IF(OR(N11=$S$1,N11=$S$2),O11,0)),\"\")","v":""},null,null,null,null,null,null,{"$f":"IF(OR(R11<>0,T11<>0,V11<>0),MAX(IF(OR(Q11=$S$1,Q11=$S$2),R11,0),IF(OR(S11=$S$1,S11=$S$2),T11,0),IF(OR(U11=$S$1,U11=$S$2),V11,0)),\"\")","v":""},null,null,null,null,null,null,{"$f":"IF(OR(Y11<>0,AA11<>0,AC11<>0),MAX(IF(OR(X11=$S$1,X11=$S$2),Y11,0),IF(OR(Z11=$S$1,Z11=$S$2),AA11,0),IF(OR(AB11=$S$1,AB11=$S$2),AC11,0)),\"\")","v":""},{"$f":"IF(OR(P11<>\"\",W11<>\"\",AD11<>\"\"),IF(AU11,\"DSQ\",IF(AND(RIGHT(G11,2)=\"PL\"),IF(P11=\"\",0,P11)+IF(W11=\"\",0,W11)+IF(AD11=\"\",0,AD11),IF(AND(RIGHT(G11,2)=\"BP\",W11<>0),W11,IF(AND(RIGHT(G11,2)=\"DL\",AD11<>0),AD11,IF(AND(RIGHT(G11,2)=\"SQ\",P11<>0),P11,0))))),\"\")","v":""},{"$f":"SUM(AF6:AF9)","v":284.46435100000002},{"$f":"IF(OR(H11=\"\",H11=0),0, ROUND(100/(VLOOKUP($G11,'IPF GL Formula'!$A$4:$F$19,3,FALSE)-VLOOKUP($G11,'IPF GL Formula'!$A$4:$F$19,4,FALSE)*EXP(-VLOOKUP($G11,'IPF GL Formula'!$A$4:$F$19,5,FALSE)*H11)),6))","v":0},2,{"$f":"J11=$S$3","v":false},{"$f":"L11=$S$3","v":false},{"$f":"N11=$S$3","v":false},{"$f":"Q11=$S$3","v":false},{"$f":"S11=$S$3","v":false},{"$f":"U11=$S$3","v":false},{"$f":"X11=$S$3","v":false},{"$f":"Z11=$S$3","v":false},{"$f":"AB11=$S$3","v":false},{"$f":"AND(AI11,AJ11,AK11)","v":false},{"$f":"AND(AL11,AM11,AN11)","v":false},{"$f":"AND(AO11,AP11,AQ11)","v":false},{"$f":"OR(AR11,AS11,AT11)","v":false}]
[1,"Op","Castro","Emma","Silverbacks",1999,"F-CL-PL",61.81,{"$f":"IF(H12=\"\",\"\",VLOOKUP(H12,WeightClasses!$A$2:$E$18,IF(LEFT(G12,1)=\"F\",IF(YEAR(TODAY())-F12<24,4,2),IF(YEAR(TODAY())-F12<24,5,3)),TRUE))","v":63},"√",95,"√",100,"√",102.5,102.5,"√",45,"√",50,"×",52.5,50,"√",115,"√",120,"√",125,125,277.5,61.4737425,{"$f":"IF(OR(H12=\"\",H12=0),0, ROUND(100/(VLOOKUP($G12,'IPF GL Formula'!$A$4:$F$19,3,FALSE)-VLOOKUP($G12,'IPF GL Formula'!$A$4:$F$19,4,FALSE)*EXP(-VLOOKUP($G12,'IPF GL Formula'!$A$4:$F$19,5,FALSE)*H12)),6))","v":0.221527},null,false,false,false,false,false,true,false,false,false,false,false,false,false]
[1,"Op","Baustert","Nadia","Silverbacks",1999,"F-CL-PL",61.61,{"$f":"IF(H13=\"\",\"\",VLOOKUP(H13,WeightClasses!$A$2:$E$18,IF(LEFT(G13,1)=\"F\",IF(YEAR(TODAY())-F13<24,4,2),IF(YEAR(TODAY())-F13<24,5,3)),TRUE))","v":63},"+",137.5,"+",142.5,"×",145,142.5,"√",80,"×",83,"×",83,80,"√",152.5,"×",155,"×",155,152.5,375,83.251874999999998,{"$f":"IF(OR(H13=\"\",H13=0),0, ROUND(100/(VLOOKUP($G13,'IPF GL Formula'!$A$4:$F$19,3,FALSE)-VLOOKUP($G13,'IPF GL Formula'!$A$4:$F$19,4,FALSE)*EXP(-VLOOKUP($G13,'IPF GL Formula'!$A$4:$F$19,5,FALSE)*H13)),6))","v":0.22200500000000001},1,false,false,true,false,true,true,false,true,true,false,false,false,false]
[1,"Op","Weber","Elyna","Silverbacks",1997,"F-CL-PL",82.83,{"$f":"IF(H14=\"\",\"\",VLOOKUP(H14,WeightClasses!$A$2:$E$18,IF(LEFT(G14,1)=\"F\",IF(YEAR(TODAY())-F14<24,4,2),IF(YEAR(TODAY())-F14<24,5,3)),TRUE))","v":84},"√",135,"√",142.5,"×",147.5,142.5,"√",77.5,"√",82.5,"√",85,85,"√",145,"√",152.5,"√",160,160,387.5,{"$f":"IF(AND(AE14<>\"\",ISNUMBER(AE14)),AG14*AE14,\"\")","v":73.586637499999995},{"$f":"IF(OR(H14=\"\",H14=0),0, ROUND(100/(VLOOKUP($G14,'IPF GL Formula'!$A$4:$F$19,3,FALSE)-VLOOKUP($G14,'IPF GL Formula'!$A$4:$F$19,4,FALSE)*EXP(-VLOOKUP($G14,'IPF GL Formula'!$A$4:$F$19,5,FALSE)*H14)),6))","v":0.18990099999999999},null,false,false,true,false,false,false,false,false,false,false,false,false,false]
[1,"Op","Ewert","Manuela","Silverbacks",1995,"F-CL-PL",82.52,{"$f":"IF(H15=\"\",\"\",VLOOKUP(H15,WeightClasses!$A$2:$E$18,IF(LEFT(G15,1)=\"F\",IF(YEAR(TODAY())-F15<24,4,2),IF(YEAR(TODAY())-F15<24,5,3)),TRUE))","v":84},"√",135,"√",142.5,"×",147.5,142.5,"√",55,"√",60,"√",62.5,62.5,"√",145,"√",155,"×",160,155,360,{"$f":"IF(AND(AE15<>\"\",ISNUMBER(AE15)),AG15*AE15,\"\")","v":68.467680000000001},{"$f":"IF(OR(H15=\"\",H15=0),0, ROUND(100/(VLOOKUP($G15,'IPF GL Formula'!$A$4:$F$19,3,FALSE)-VLOOKUP($G15,'IPF GL Formula'!$A$4:$F$19,4,FALSE)*EXP(-VLOOKUP($G15,'IPF GL Formula'!$A$4:$F$19,5,FALSE)*H15)),6))","v":0.190188},null,false,false,true,false,false,false,false,false,true,false,false,false,false]
[null,null,null,null,null,null,null,null,{"$f":"IF(H16=\"\",\"\",VLOOKUP(H16,WeightClasses!$A$2:$E$18,IF(LEFT(G16,1)=\"F\",IF(YEAR(TODAY())-F16<24,4,2),IF(YEAR(TODAY())-F16<24,5,3)),TRUE))","v":""},null,null,null,null,null,null,"",null,null,null,null,null,null,"",null,null,null,null,null,null,"","",{"$f":"SUM(AF12:AF15)","v":286.77993500000002},{"$f":"IF(OR(H16=\"\",H16=0),0, ROUND(100/(VLOOKUP($G16,'IPF GL Formula'!$A$4:$F$19,3,FALSE)-VLOOKUP($G16,'IPF GL Formula'!$A$4:$F$19,4,FALSE)*EXP(-VLOOKUP($G16,'IPF GL Formula'!$A$4:$F$19,5,FALSE)*H16)),6))","v":0},1,false,false,false,false,false,false,false,false,false,false,false,false,false]
[2,"Sj","Best","Jonah","SC Hamm",2009,"M-CL-PL",60.74,{"$f":"IF(H17=\"\",\"\",VLOOKUP(H17,WeightClasses!$A$2:$E$18,IF(LEFT(G17,1)=\"F\",IF(YEAR(TODAY())-F17<24,4,2),IF(YEAR(TODAY())-F17<24,5,3)),TRUE))","v":66},"√",95,"√",102.5,"√",110,110,"√",65,"√",72.5,"×",77.5,72.5,"√",115,"√",125,"√",135,135,317.5,51.727417500000001,{"$f":"IF(OR(H17=\"\",H17=0),0, ROUND(100/(VLOOKUP($G17,'IPF GL Formula'!$A$4:$F$19,3,FALSE)-VLOOKUP($G17,'IPF GL Formula'!$A$4:$F$19,4,FALSE)*EXP(-VLOOKUP($G17,'IPF GL Formula'!$A$4:$F$19,5,FALSE)*H17)),6))","v":0.16292100000000001},null,false,false,false,false,false,true,false,false,false,false,false,false,false]
[2,"Sj","Vicente Santana","Thomas","SC Hamm",2006,"M-CL-PL",75.73,{"$f":"IF(H18=\"\",\"\",VLOOKUP(H18,WeightClasses!$A$2:$E$18,IF(LEFT(G18,1)=\"F\",IF(YEAR(TODAY())-F18<24,4,2),IF(YEAR(TODAY())-F18<24,5,3)),TRUE))","v":83},"√",180,"+",192.5,"+",200,200,"+",135,"+",137.5,"+",140,140,"√",207.5,"+",220.5,"×",225,220.5,560.5,81.308372000000006,{"$f":"IF(OR(H18=\"\",H18=0),0, ROUND(100/(VLOOKUP($G18,'IPF GL Formula'!$A$4:$F$19,3,FALSE)-VLOOKUP($G18,'IPF GL Formula'!$A$4:$F$19,4,FALSE)*EXP(-VLOOKUP($G18,'IPF GL Formula'!$A$4:$F$19,5,FALSE)*H18)),6))","v":0.145064},null,false,false,false,false,false,false,false,false,true,false,false,false,false]
[2,"Sj","Ferreira","Aaron","SC Hamm",2006,"M-CL-PL",114.08,{"$f":"IF(H19=\"\",\"\",VLOOKUP(H19,WeightClasses!$A$2:$E$18,IF(LEFT(G19,1)=\"F\",IF(YEAR(TODAY())-F19<24,4,2),IF(YEAR(TODAY())-F19<24,5,3)),TRUE))","v":120},"√",195,"√",207.5,"×",212.5,207.5,"√",130,"√",137.5,"×",140,137.5,"√",195,"√",210,"√",220,220,565,67.164374999999993,{"$f":"IF(OR(H19=\"\",H19=0),0, ROUND(100/(VLOOKUP($G19,'IPF GL Formula'!$A$4:$F$19,3,FALSE)-VLOOKUP($G19,'IPF GL Formula'!$A$4:$F$19,4,FALSE)*EXP(-VLOOKUP($G19,'IPF GL Formula'!$A$4:$F$19,5,FALSE)*H19)),6))","v":0.11887499999999999},null,false,false,true,false,false,true,false,false,false,false,false,false,false]
[2,"Jr","Scheepers","Ethan","SC Hamm",2005,"M-CL-PL",73.02,{"$f":"IF(H20=\"\",\"\",VLOOKUP(H20,WeightClasses!$A$2:$E$18,IF(LEFT(G20,1)=\"F\",IF(YEAR(TODAY())-F20<24,4,2),IF(YEAR(TODAY())-F20<24,5,3)),TRUE))","v":74},"√",155,"√",162.5,"×",170,162.5,"√",95,"√",100,"√",105,105,"√",195,"√",210,"+",214.5,214.5,482,71.254059999999996,{"$f":"IF(OR(H20=\"\",H20=0),0, ROUND(100/(VLOOKUP($G20,'IPF GL Formula'!$A$4:$F$19,3,FALSE)-VLOOKUP($G20,'IPF GL Formula'!$A$4:$F$19,4,FALSE)*EXP(-VLOOKUP($G20,'IPF GL Formula'!$A$4:$F$19,5,FALSE)*H20)),6))","v":0.14782999999999999},null,false,false,true,false,false,false,false,false,false,false,false,false,false]
{"$rows_left_out":21}
{"sheet":"Instructions","index":1,"n_rows":57,"n_cols":3,"rows_kept":57,"cut":false,"hidden":false,"merged":[]}
[]
[null,"1.  Enter lifter information into the spreadsheet in the approriate columns.  Column titles can be changed or Translated to another language after Unprotecting the Spreadsheet."]
[null,null,"A separate Scoresheet can be created for each Men/Women, Classic/Equipped, Powerlifting/Bench Press or they may all be entered on the same scoresheet."]
[]
[null,"2.  When Birth Year and Body Weight are entered the will automatically determine the correct WT Class."]
[]
[null,"3.  Any of the 8 IPF GL Formulas can be selected for a lifter.  A description of the each formula can be found on the IPF GL Formula sheet.  Use the drop down menu in the cell."]
[null,null,"Lifter1 in the first row is entered in Female-Classic-Powerlifting.  The IPF Formula to calculate her IPF Points is F-CL-PL."]
[]
[null,"4.  The gray areas contain formulas and information that will be protected when you Protect the spreadsheet "]
[]
[]
[]
[]
[]
[]
[]
[]
[]
[]
{"$rows_left_out":38}
{"sheet":"IPF GL Formula","index":2,"n_rows":19,"n_cols":5,"rows_kept":19,"cut":false,"hidden":true,"merged":[[0,0,1,4]]}
["Reference Values"]
[]
["IPF GL Formula","Description","A","B","C"]
["M-CL-PL","Male Classic 3-Lift",1199.72839,1025.1816200000001,9.2099999999999994E-3]
["M-CL-SQ","Male Classic Squat",491.82393999999999,479.13900999999998,9.5200000000000007E-3]
["M-CL-BP","Male Classic Bench",320.98041000000001,281.40258,1.008E-2]
["M-CL-DL","Male Classic DeadLift",358.44893000000002,721.54069000000004,3.1699999999999999E-2]
["M-EQ-PL","Male Equipped 3-Lift",1236.2511500000001,1449.2186400000001,1.644E-2]
["M-EQ-SQ","Male Equipped Squat",515.91349000000002,501.55605000000003,1.251E-2]
["M-EQ-BP","Male Equipped Bench",381.22073,733.79377999999997,2.3980000000000001E-2]
["M-EQ-DL","Male Equipped DeadLift",373.22847000000002,1048.6461999999999,3.6089999999999997E-2]
["F-CL-PL","Female Classic 3-Lift",610.32795999999996,1045.5928200000001,3.048E-2]
["F-CL-SQ","Female Classic Squat",257.39834000000002,381.74158999999997,2.3990000000000001E-2]
["F-CL-BP","Female Classic Bench",142.40397999999999,442.52670999999998,4.7239999999999997E-2]
["F-CL-DL","Female Classic DeadLift",238.53236999999999,624.91510000000005,4.3470000000000002E-2]
["F-EQ-PL","Female Equipped 3-Lift",758.63878,949.31381999999996,2.435E-2]
["F-EQ-SQ","Female Equipped Squat",319.90471000000002,345.45569999999998,1.9939999999999999E-2]
["F-EQ-BP","Female Equipped Bench",221.82209,357.00376999999997,2.937E-2]
["F-EQ-DL","Female Equipped DeadLift",245.61376000000001,567.83844999999997,4.1950000000000001E-2]

{"sheet":"WeightClasses","index":3,"n_rows":18,"n_cols":5,"rows_kept":18,"cut":false,"hidden":true,"merged":[]}
[null,"F","M","F-Jr","M-Jr"]
[10,47,59,43,53]
[43.01,47,59,47,53]
[47.01,52,59,52,53]
[52.01,57,59,57,53]
[53.01,57,59,57,59]
[57.01,63,59,63,59]
[59.01,63,66,63,66]
[63.01,69,66,69,66]
[66.010000000000005,69,74,69,74]
[69.010000000000005,76,74,76,74]
[74.010000000000005,76,83,76,83]
[76.010000000000005,84,83,84,83]
[83.01,84,93,84,93]
[84.01,"84+",93,"84+",93]
[93.01,"84+",105,"84+",105]
[105.01,"84+",120,"84+",120]
[120.01,"84+","120+","84+","120+"]